{"text_format":"1","workbook":"xlsx","n_sheets":10,"sheets":["Agreement","Help","Project Info","Summary","Inventory","Factor Tables","Notes","Utility Admin","Reader","Reader2"],"not_rendered":{"charts":0,"images":10,"macros":1,"external_links":0,"defined_names":31,"comments":1,"pivot_tables":0},"unopened":[],"bounds":{"document_bytes":16777216,"sheet_cells":100000,"rows_first":2000,"rows_last":500,"rows_between":2000,"halvings":0,"cell_chars":16384,"cell_head_chars":4096},"cells_cut":0,"cells_raw":0,"read":"whole","date_system":"1900"}

{"sheet":"Agreement","index":0,"n_rows":25,"n_cols":13,"rows_kept":25,"cut":false,"hidden":false,"merged":[[16,2,16,11],[18,2,18,11],[20,2,20,11],[2,2,2,11],[24,2,24,11],[22,2,22,11],[4,2,4,11],[6,2,6,11],[8,2,8,11],[10,2,10,11],[12,2,12,11],[14,2,14,11]]}
[null,"\n\n\n\n\n\n",null,null,null,null,null,null,null,null,null,null,"\n\n\n\n\n\n"]
[]
[null,null,"Commercial Cool Roof Calculator"]
[]
[null,null,"[UTILITY] is making available a downloadable Software to facilitate project savings calculations. The Software is in a Microsoft Excel™ spreadsheet format. If the file does not open in your browser window, use the save file to disk option and open it within the application. In order to use the Software, users must accept the following license agreement:"]
[]
[null,null,"NOTICE TO USER: "]
[]
[null,null,"1. THIS IS A CONTRACT. PLEASE READ IT CAREFULLY. USE OF THIS SOFTWARE IS NOT REQUIRED FOR PARTICIPATION IN THIS UTILITY PROGRAM. BY USING THE SOFTWARE CONTAINED HEREIN YOU ARE INDICATING YOUR ACCEPTANCE OF ALL THE TERMS AND CONDITIONS OF THIS AGREEMENT. IF YOU DO NOT AGREE WITH THE TERMS AND CONDITIONS OF THIS AGREEMENT, PLEASE DECLINE WHERE INSTRUCTED, AND YOU WILL NOT BE ABLE TO USE THE SOFTWARE."]
[]
{"$rows_left_out":16}
{"sheet":"Help","index":1,"n_rows":18,"n_cols":2,"rows_kept":18,"cut":false,"hidden":true,"merged":[]}
[]
[null,"The Cool Roof Calculator (CRC) is provided to facilitate the completion of Final Applications that involve commercial cool roof measures. Each unique application should be entered on a separate line within the survey. Information must be supplied for all installed commercial cool roof materials.  "]
[]
[null,"General Guidelines:"]
[]
[null,"Gray shaded cells are either automatically calculated, or no user input is required."]
[]
[null,"Section 1     Project Information tab"]
[null,"Fill out all required information as signified by a red \"Required Input\" message. This includes (but is not limited to) selecting the appropriate Utility Name and Weather Zone."]
[]
{"$rows_left_out":9}
{"sheet":"Project Info","index":2,"n_rows":259,"n_cols":36,"rows_kept":259,"cut":false,"hidden":true,"merged":[[7,3,7,10],[10,3,10,10],[23,4,23,6],[32,3,32,5],[33,3,33,10],[23,7,23,10],[23,1,23,3],[22,4,22,6],[1,3,1,9],[2,3,2,9],[3,3,3,9],[22,1,22,3],[22,7,22,10],[5,3,5,10],[8,3,8,10],[17,8,17,10],[18,3,18,10],[12,3,12,10],[16,8,16,10],[16,3,16,5],[15,3,15,10],[17,3,17,4],[19,3,19,10],[20,3,20,5],[37,3,37,8],[36,1,36,10],[38,3,38,8],[28,3,28,10],[29,3,29,10],[30,3,30,4],[30,8,30,10],[31,3,31,10]]}
[]
[null,{"$f":"IF($D$6=\"\",\"\",VLOOKUP($D$6,PicTable,2,FALSE))","v":""},null,{"$f":"IF($D$6=\"\",\"Please Select Utility\",$D$6)","v":"Please Select Utility"},null,null,null,null,null,null,{"$f":"IF($D$6=\"\",\"\",VLOOKUP(Texas,PicTable,2,FALSE))","v":""},null,null,null,"Texas","Picture 1",null,"Utility",{"$f":"IF($D$6=\"\",\"-\",VLOOKUP($D$6,$R$3:$S$11,2,FALSE))","v":"-"},null,"SWEPCOProg","TCCProg","TNCProg","CNPProg","EPEProg","EntProg","OncorProg","TNMPProg","XcelProg",null,"County","Climate Zone","City",null,"Climate Zone","City"]
[null,null,null,{"$f":"IF($D$11=\"\",\"Please Select Program Type\",$D$11)","v":"Please Select Program Type"},null,null,null,null,null,null,null,null,null,null,"New Mexico","Picture 2",null,"AEP SWEPCO","SWEPCOProg",null,{"$f":"'Utility Admin'!K4","v":"Commercial SOP"},{"$f":"'Utility Admin'!K6","v":"Commercial SOP"},{"$f":"'Utility Admin'!K7","v":"Commercial SOP"},{"$f":"'Utility Admin'!K8","v":"Commercial SOP"},"N/a",{"$f":"'Utility Admin'!K10","v":"Commercial Solutions"},{"$f":"'Utility Admin'!K11","v":"Commercial SOP"},{"$f":"'Utility Admin'!K12","v":"Commercial Solutions"},{"$f":"'Utility Admin'!K15","v":"Commercial SOP"},null,"Anderson",2,{"$f":"VLOOKUP($AF3,$AI$3:$AJ$7,2,FALSE)","v":"Dallas"},null,1,"Amarillo"]
[null,null,null,{"$f":"CONCATENATE(LEFT(Summary!$C$18,4),\" Commercial Cool Roof Calculator\")","v":"2024 Commercial Cool Roof Calculator"},null,null,null,null,null,null,null,null,null,null,"AEP SWEPCO","Picture 3",null,"AEP Texas Central Division","TCCProg",null,{"$f":"'Utility Admin'!K5","v":"COMPASS"},null,null,{"$f":"'Utility Admin'!K9","v":"Commercial MTP"},null,null,null,{"$f":"'Utility Admin'!K13","v":"SCORE/CitySmart"},{"$f":"'Utility Admin'!K16","v":"Retro-Commissioning"},null,"Andrews",2,{"$f":"VLOOKUP($AF4,$AI$3:$AJ$7,2,FALSE)","v":"Dallas"},null,2,"Dallas"]
[null,null,null,null,null,null,null,null,null,null,null,null,null,null,"AEP Texas Central Division","Picture 3",null,"AEP Texas North Division","TNCProg",null,null,null,null,null,null,null,null,{"$f":"'Utility Admin'!K14","v":"Small SCORE/CitySmart"},{"$f":"'Utility Admin'!K17","v":"Small Business Market Transformation"},null,"Angelina",2,"Dallas",null,3,"Houston"]
[null,null,"Utility:",null,null,null,null,null,null,null,null,null,"* Required Input",null,"AEP Texas North Division","Picture 3",null,"CenterPoint Energy","CNPProg",null,null,null,null,null,null,null,null,null,null,null,"Aransas",4,"Corpus Christi",null,4,"Corpus Christi"]
[null,null,null,null,null,null,null,null,null,null,null,null,null,null,"CenterPoint Energy","Picture 4",null,"Entergy","EntProg",null,null,null,null,null,null,null,null,null,null,null,"Archer",1,"Amarillo",null,5,"El Paso"]
[null,null,"County:",null,null,null,null,null,null,null,null,null,"* Required Input",null,"El Paso Electric","Picture 5",null,"Oncor","OncorProg",null,null,null,null,null,null,null,null,null,null,null,"Armstrong",1,"Amarillo"]
[null,null,"Climate Zone:",{"$f":"IF($D$8=\"\",\"Select county in previous cell\",VLOOKUP($D$8,$AE:$AG,3,FALSE))","v":"Select county in previous cell"},null,null,null,null,null,null,null,null,null,null,"Entergy","Picture 6",null,"Texas-New Mexico Power","TNMPProg",null,null,null,null,null,null,null,null,null,null,null,"Atascosa",3,"Houston"]
[null,null,null,null,null,null,null,null,null,null,null,null,null,null,"Oncor","Picture 7",null,"Xcel Energy","XcelProg",null,null,null,null,null,null,null,null,null,null,null,"Austin",3,"Houston"]
{"$rows_left_out":250}
{"sheet":"Summary","index":3,"n_rows":18,"n_cols":6,"rows_kept":18,"cut":false,"hidden":true,"merged":[[14,1,15,1],[12,1,13,1],[10,1,10,5],[1,2,1,5],[5,2,5,5],[6,2,6,5],[7,2,7,5],[8,2,8,5],[4,2,4,5],[2,2,2,5],[3,2,3,5]]}
[{"$f":"$C$18","v":2024.1}]
[null,"Business Name:",{"$f":"IF('Project Info'!$D$13=\"\",\"\",'Project Info'!$D$13)","v":""}]
[null,"Project Site Address:",{"$f":"IF('Project Info'!$D$20=\"\",\"\",'Project Info'!$D$20)","v":""}]
[null,"City:",{"$f":"IF('Project Info'!$D$21=\"\",\"\",'Project Info'!$D$21)","v":""}]
[null,"State:",{"$f":"IF('Project Info'!$I$21=\"\",\"\",'Project Info'!$I$21)","v":""}]
[null,"ZIP Code:",{"$f":"IF('Project Info'!$K$21=\"\",\"\",'Project Info'!$K$21)","v":""}]
[null,"Sponsor Name:",{"$f":"IF('Project Info'!$D$29=\"\",\"\",'Project Info'!$D$29)","v":""}]
[null,"Utility Name:",{"$f":"IF('Project Info'!$D$6=\"\",\"\",'Project Info'!$D$6)","v":""}]
[null,"Climate Zone:",{"$f":"IF('Project Info'!$D$9=\"Select county in previous cell\",\"\",'Project Info'!$D$9)","v":""}]
[]
{"$rows_left_out":9}
{"sheet":"Inventory","index":4,"n_rows":22,"n_cols":34,"rows_kept":22,"cut":false,"hidden":true,"merged":[[3,1,4,13],[7,4,8,4],[7,6,8,6],[7,10,8,10],[6,19,8,19],[6,23,8,23],[6,24,8,24],[6,16,8,16],[6,18,8,18],[6,17,8,17],[6,22,8,22],[6,21,8,21],[6,25,8,25],[6,26,8,26],[21,1,21,2],[6,2,8,2],[7,12,8,12],[7,5,8,5],[6,1,8,1],[7,7,8,7],[7,8,8,8],[7,3,8,3],[6,15,8,15],[7,13,8,13],[7,11,8,11],[7,9,8,9],[6,14,8,14],[6,20,8,20],[6,28,6,29],[6,30,8,30],[7,28,8,28],[7,29,8,29],[6,27,8,27]]}
[]
[null,{"$f":"LEFT(Summary!C18,4)","v":"2024"},{"$f":"IF(AND('Project Info'!$D$13<>\"\",'Project Info'!$D$20<>\"\"),CONCATENATE(\"Commercial Cool Roof Calculator (CRC): \",'Project Info'!$D$13,\" (\",'Project Info'!$D$20,\")\"),IF(AND('Project Info'!$D$13<>\"\",'Project Info'!$D$20=\"\"),CONCATENATE(\"Commercial Cool Roof Calculator (CRC): \",'Project Info'!$D$13),IF(AND('Project Info'!$D$13=\"\",'Project Info'!$D$20<>\"\"),CONCATENATE(\"Commercial Cool Roof Calculator (CRC): \",'Project Info'!$D$20),\"Commercial Cool Roof Calculator (CRC)\")))","v":"Commercial Cool Roof Calculator (CRC)"},null,null,null,null,null,null,null,null,null,null,null,null,null,null,{"$f":"CONCATENATE(\"v \",Summary!C18)","v":"v 2024.1"}]
[]
[null,"Please fill out one copy of this form for each customer site involved in the project where commercial cool roof materials are being installed.\nFrom left to right, fill in all non-shaded cells of the roof build-up inventory. Shaded (gray) values are either automatically calculated or not necessary. Use drop-down lists (if available).\nTo print this form click on File/Print/OK.",null,null,null,null,null,null,null,null,null,null,null,null,null,"Total kW\nSavings","Total kWh\nSavings","Estimated\nPayment"]
[null,null,null,null,null,null,null,null,null,null,null,null,null,null,null,{"$f":"IFERROR($P$21,0)","v":0},{"$f":"IFERROR($Q$21,0)","v":0},{"$f":"IFERROR($R$21,0)","v":0}]
[]
[null,null,"Building Type\n(select from list)","Roof Description",null,null,null,null,"Installed Cool Roof Rating Council (CRRC) Material Description",null,null,null,null,null,"Measure\nLife","Total kW\nSavings","Total kWh\nSavings","Estimated\nPayment","R-Value\nLookup","Existing\nR-Value","Installed\nR-Value","Savings\nFactor\nLookup","PSDF","PWDF","ESF","Summer\nkW\nSavings","Winter\nkW\nSavings","kWh\nSavings","Incentive Rates",null,"Estimated\nPayment"]
[null,null,null,"Roof Slope","Treated\nRoof Surface Area\nover Conditioned\nSpace ONLY\n(ft2)","Percent of Total\nRoof Surface Area\nover Conditioned Space ONLY\n(Treated Area ÷\nTotal Area)","Existing Insulation\nR-Value\n(if known)","Year of Building Construction\n(if existing R-value unknown)","Manufacturer","Model","Installed Insulation\nR-Value\n(Defaults to\nExisting Insulation\nR-value)","Initial\nSolar\nReflectance","3-Year\nSolar\nReflectance","Rated Life\n(Years)",null,null,null,null,null,null,null,null,null,null,null,null,null,null,"$/kW","$/kWh"]
[]
[null,1,null,null,null,null,null,null,null,null,null,null,null,null,15,{"$f":"ROUND(IF(OR($C10=\"\",$D10<>\"Low: 2:12 or less\",$E10=\"\",$F10=\"\",$F10<0.75,AND($G10=\"\",$H10=\"\"),$I10=\"\",$J10=\"\",$K10=\"\",$L10=\"\",$L10<0.65,$M10=\"\",$M10<0.5,$N10=\"\"),0,MAX(ABS($Z10),ABS($AA10))),2)","v":0},{"$f":"ROUND(IF(OR($C10=\"\",$D10<>\"Low: 2:12 or less\",$E10=\"\",$F10=\"\",$F10<0.75,AND($G10=\"\",$H10=\"\"),$I10=\"\",$J10=\"\",$K10=\"\",$L10=\"\",$L10<0.65,$M10=\"\",$M10<0.5,$N10=\"\"),0,$AB10),0)","v":0},{"$f":"IFERROR($AE10,0)","v":0},{"$f":"IF(AND($G10=\"\",$H10=\"\"),\"\",IF($G10<>\"\",VLOOKUP($G10,$AG$10:$AH$12,2,FALSE),VLOOKUP($T10,$AG$10:$AH$12,2,FALSE)))","v":""},{"$f":"IF(AND($G10=\"\",$H10=\"\"),\"\",IF(AND($G10=\"\",$H10<>\"\"),VLOOKUP($H10,$AG$14:$AH$16,2,FALSE),$G10))","v":""},{"$f":"IF($K10=\"\",\"\",$K10)","v":""},{"$f":"CONCATENATE(C10,\" \",T10,\" \",U10)","v":"  "},{"$f":"IFERROR(VLOOKUP($V10,'Factor Tables'!$E$265:$H$312,3,FALSE),0)","v":0},{"$f":"IFERROR(VLOOKUP($V10,'Factor Tables'!$E$265:$H$312,4,FALSE),0)","v":0},{"$f":"IFERROR(VLOOKUP($V10,'Factor Tables'!$E$265:$H$312,2,FALSE),0)","v":0},{"$f":"$E10*$W10*0.00001","v":0},{"$f":"$E10*$X10*0.000001","v":0},{"$f":"$E10*$Y10","v":0},{"$f":"'Utility Admin'!$E$4","v":0},{"$f":"'Utility Admin'!$F$4","v":0},{"$f":"IFERROR(IF(ABS(Summary!$D$16)<=ABS(Summary!$C$16)*'Utility Admin'!$G$4,ROUND($P10,2)*'Utility Admin'!$E$4+ROUND($Q10,0)*'Utility Admin'!$F$4,ROUND($P10,2)*'Utility Admin'!$E$4+ROUND($P10,2)*'Utility Admin'!$G$4*'Utility Admin'!$F$4),0)","v":0},null,"R <= 13","PostRVal3"]
{"$rows_left_out":13}
{"sheet":"Factor Tables","index":5,"n_rows":312,"n_cols":10,"rows_kept":312,"cut":false,"hidden":true,"merged":[[262,2,262,6],[2,1,3,1],[54,1,55,1],[106,1,107,1],[158,1,159,1],[210,1,211,1],[262,1,263,1],[2,2,2,6],[54,2,54,6],[106,2,106,6],[158,2,158,6],[210,2,210,6]]}
[]
[null,"Deemed Savings Coefficients",null,null,null,null,null,"Climate Zone 1: Amarillo"]
[null,"Building Type","Demand Factors"]
[null,null,"Pre R-Value","Post R-Value","Lookup","ESF","PSDF","PWDF"]
[null,"Retail","R <= 13","R <= 13",{"$f":"CONCATENATE(B5,\" \",C5,\" \",D5)","v":"Retail R <= 13 R <= 13"},0.72,19.28,31.74,null,"Education (Chiller)"]
[null,"Retail","R <= 13","13 < R <= 20","Retail R <= 13 13 < R <= 20",1.26,36.229999999999997,36.71,null,"Education (RTU)"]
[null,"Retail","R <= 13","20 < R","Retail R <= 13 20 < R",1.25,38.58,35.31,null,"Hotel"]
[null,"Retail","13 < R <= 20","13 < R <= 20","Retail 13 < R <= 20 13 < R <= 20",0.13,4.8099999999999996,1.88,null,"Office (Chiller)"]
[null,"Retail","13 < R <= 20","20 < R","Retail 13 < R <= 20 20 < R",0.12,6.47,0.48,null,"Office (RTU)"]
[null,"Retail","20 < R","20 < R","Retail 20 < R 20 < R",0.09,3.32,1.3,null,"Retail"]
{"$rows_left_out":303}
{"sheet":"Notes","index":6,"n_rows":2,"n_cols":2,"rows_kept":2,"cut":false,"hidden":true,"merged":[]}
[]
[null,"Utility Admin use ONLY. Use this page to enter any project notes for the statewide evaluator."]

{"sheet":"Utility Admin","index":7,"n_rows":17,"n_cols":16,"rows_kept":17,"cut":false,"hidden":true,"merged":[[1,14,1,15],[1,12,1,13],[1,11,2,11],[1,4,1,5],[1,1,2,1],[1,8,2,8],[1,3,2,3],[1,10,2,10],[1,2,2,2],[1,9,2,9]]}
[]
[null,"Utility","State","Program","Rates",null,"LFC",null,"Utility","State","Program","Utility/Program\nDesignation","Rates",null,"Load Factor"]
[null,null,null,null,"Demand\n(kW)","Energy\n(kWh)","kWh/kW",null,null,null,null,null,"Demand\n(kW)","Energy\n(kWh)","%","kWh/kW"]
[null,{"$f":"IF('Project Info'!$D$6=\"\",\"Not Selected\",'Project Info'!$D$6)","v":"Not Selected"},"Texas",{"$f":"IF('Project Info'!$D$11=\"\",\"Not Selected\",'Project Info'!$D$11)","v":"Not Selected"},{"$f":"IF(OR($B$4=\"Not Selected\",$C$4=\"Not Selected\",$D$4=\"Not Selected\"),0,VLOOKUP(CONCATENATE($B$4,$C$4,$D$4),$L:$N,2,FALSE))","v":0},{"$f":"IF(OR($B$4=\"Not Selected\",$C$4=\"Not Selected\",$D$4=\"Not Selected\"),0,VLOOKUP(CONCATENATE($B$4,$C$4,$D$4),$L:$N,3,FALSE))","v":0},{"$f":"IF(OR($B$4=\"Not Selected\",$C$4=\"Not Selected\",$D$4=\"Not Selected\"),0,VLOOKUP(CONCATENATE($B$4,$C$4,$D$4),$L:$P,5,FALSE))","v":0},null,"AEP SWEPCO","Texas","Commercial SOP",{"$f":"CONCATENATE($I4,$J4,$K4)","v":"AEP SWEPCOTexasCommercial SOP"},240,0.08,1,999999999]
[null,null,null,null,null,null,null,null,"AEP SWEPCO","Texas","COMPASS","AEP SWEPCOTexasCOMPASS",400,0,1,999999999]
[null,null,null,null,null,null,null,null,"AEP Texas Central Division","Texas","Commercial SOP",{"$f":"CONCATENATE($I6,$J6,$K6)","v":"AEP Texas Central DivisionTexasCommercial SOP"},200,7.0000000000000007E-2,1,999999999]
[null,null,null,null,null,null,null,null,"AEP Texas North Division","Texas","Commercial SOP","AEP Texas North DivisionTexasCommercial SOP",200,7.0000000000000007E-2,1,999999999]
[null,null,null,null,null,null,null,null,"CenterPoint Energy","Texas","Commercial SOP","CenterPoint EnergyTexasCommercial SOP",240,0.09,1,999999999]
[null,null,null,null,null,null,null,null,"CenterPoint Energy","Texas","Commercial MTP","CenterPoint EnergyTexasCommercial MTP",240,0.09,1,999999999]
[null,null,null,null,null,null,null,null,"Entergy","Texas","Commercial Solutions","EntergyTexasCommercial Solutions",250,0.02,1,999999999]
{"$rows_left_out":8}
{"sheet":"Reader","index":8,"n_rows":18,"n_cols":6,"rows_kept":18,"cut":false,"hidden":true,"merged":[]}
[2024.1]
[null,"Business Name:"]
[null,"Project Site Address:"]
[null,"City:"]
[null,"State:"]
[null,"ZIP Code:"]
[null,"Sponsor Name:"]
[null,"Utility Name:"]
[null,"Climate Zone:"]
[]
{"$rows_left_out":9}
{"sheet":"Reader2","index":9,"n_rows":22,"n_cols":34,"rows_kept":22,"cut":false,"hidden":true,"merged":[]}
[]
[]
[]
[]
[]
[]
[null,null,"Building Type\n(select from list)","Roof Description",null,null,null,null,"Installed Cool Roof Rating Council (CRRC) Material Description",null,null,null,null,null,"Measure\nLife","Total kW\nSavings","Total kWh\nSavings","Estimated\nPayment","R-Value\nLookup","Existing\nR-Value","Installed\nR-Value","Savings\nFactor\nLookup","PSDF","PWDF","ESF","Summer\nkW\nSavings","Winter\nkW\nSavings","kWh\nSavings","Incentive Rates",null,"Estimated\nPayment"]
[null,null,null,"Roof Slope","Treated\nRoof Surface Area\nover Conditioned\nSpace ONLY\n(ft2)","Percent of Total\nRoof Surface Area\nover Conditioned Space ONLY\n(Treated Area ÷\nTotal Area)","Existing Insulation\nR-Value\n(if known)","Year of Building Construction\n(if existing R-value unknown)","Manufacturer","Model","Installed Insulation\nR-Value\n(Defaults to\nExisting Insulation\nR-value)","Initial\nSolar\nReflectance","3-Year\nSolar\nReflectance","Rated Life\n(Years)",null,null,null,null,null,null,null,null,null,null,null,null,null,null,"$/kW","$/kWh"]
[]
[null,1,null,null,null,null,null,null,null,null,null,null,null,null,15,0,0,0,null,null,null,"  ",0,0,0,0,0,0,0,0,0,null,"R <= 13","PostRVal3"]
{"$rows_left_out":12}